Vocabulary for the IVOA Unified Content Descriptors (Version 20080623, 2008-06-23)
type: ConceptScheme
has top concept: Arith
has top concept: Em
has top concept: Instr
has top concept: Meta
has top concept: Obs
has top concept: Phot
has top concept: Phys
has top concept: Pos
has top concept: Spect
has top concept: Src
has top concept: Stat
has top concept: Time

Arith
type: Concept
definition: Arithmetic quantities
narrower: Arithdiff
narrower: Arithfactor
narrower: Arithgrad
narrower: Arithrate
narrower: Arithratio
narrower: Arithzp
pref label: arith
scope note: Q: means that the word can be used indifferently as first or secondary word

Arithdiff
type: Concept
broader: Arith
definition: Difference between two quantities described by the same UCD
pref label: arith.diff
scope note: S: stands for only secondary: the word cannot be used as the first word to describe a single quantity

Arithfactor
type: Concept
broader: Arith
definition: Numerical factor
pref label: arith.factor
scope note: P: means that the word can only be used as primary or first word

Arithgrad
type: Concept
broader: Arith
definition: Gradient
pref label: arith.grad
scope note: P: means that the word can only be used as primary or first word

Arithrate
type: Concept
broader: Arith
definition: Rate (per time unit)
pref label: arith.rate
scope note: P: means that the word can only be used as primary or first word

Arithratio
type: Concept
broader: Arith
definition: Ratio between two quantities described by the same UCD
pref label: arith.ratio
scope note: S: stands for only secondary: the word cannot be used as the first word to describe a single quantity

Arithzp
type: Concept
broader: Arith
definition: Zero point
pref label: arith.zp
scope note: Q: means that the word can be used indifferently as first or secondary word

Em
type: Concept
definition: Electromagnetic spectrum
narrower: Embin
narrower: Emenergy
narrower: Emfreq
narrower: Emgamma
narrower: Emir
narrower: Emline
narrower: Emmm
narrower: Emopt
narrower: Emradio
narrower: Emuv
narrower: Emwavenumber
narrower: Emwl
narrower: Emxray
pref label: em
scope note: S: stands for only secondary: the word cannot be used as the first word to describe a single quantity

Embin
type: Concept
broader: Em
definition: Channel / instrumental spectral bin coordinate (bin number)
pref label: em.bin
scope note: Q: means that the word can be used indifferently as first or secondary word

Emenergy
type: Concept
broader: Em
definition: Energy value in the em frame
pref label: em.energy
scope note: Q: means that the word can be used indifferently as first or secondary word

Emfreq
type: Concept
broader: Em
definition: Frequency value in the em frame
pref label: em.freq
scope note: Q: means that the word can be used indifferently as first or secondary word

Emgamma
type: Concept
broader: Em
definition: Gamma rays part of the spectrum
narrower: Emgammahard
narrower: Emgammasoft
pref label: em.gamma
scope note: S: stands for only secondary: the word cannot be used as the first word to describe a single quantity

Emgammahard
type: Concept
broader: Emgamma
definition: Hard gamma ray (>500 keV)
pref label: em.gamma.hard
scope note: S: stands for only secondary: the word cannot be used as the first word to describe a single quantity

Emgammasoft
type: Concept
broader: Emgamma
definition: Soft gamma ray (120 - 500 keV)
pref label: em.gamma.soft
scope note: S: stands for only secondary: the word cannot be used as the first word to describe a single quantity

Emir
type: Concept
broader: Em
definition: Infrared part of the spectrum
narrower: Emir1530um
narrower: Emir3060um
narrower: Emir34um
narrower: Emir48um
narrower: Emir60100um
narrower: Emir815um
narrower: Emirfir
narrower: Emirh
narrower: Emirj
narrower: Emirk
narrower: Emirmir
narrower: Emirnir
pref label: em.IR
scope note: S: stands for only secondary: the word cannot be used as the first word to describe a single quantity

Emir1530um
type: Concept
broader: Emir
definition: Infrared between 15 and 30 micron
pref label: em.IR.15-30um
scope note: S: stands for only secondary: the word cannot be used as the first word to describe a single quantity

Emir3060um
type: Concept
broader: Emir
definition: Infrared between 30 and 60 micron
pref label: em.IR.30-60um
scope note: S: stands for only secondary: the word cannot be used as the first word to describe a single quantity

Emir34um
type: Concept
broader: Emir
definition: Infrared between 3 and 4 micron
pref label: em.IR.3-4um
scope note: S: stands for only secondary: the word cannot be used as the first word to describe a single quantity

Emir48um
type: Concept
broader: Emir
definition: Infrared between 4 and 8 micron
pref label: em.IR.4-8um
scope note: S: stands for only secondary: the word cannot be used as the first word to describe a single quantity

Emir60100um
type: Concept
broader: Emir
definition: Infrared between 60 and 100 micron
pref label: em.IR.60-100um
scope note: S: stands for only secondary: the word cannot be used as the first word to describe a single quantity

Emir815um
type: Concept
broader: Emir
definition: Infrared between 8 and 15 micron
pref label: em.IR.8-15um
scope note: S: stands for only secondary: the word cannot be used as the first word to describe a single quantity

Emirfir
type: Concept
broader: Emir
definition: Far-Infrared, 30-100 microns
pref label: em.IR.FIR
scope note: S: stands for only secondary: the word cannot be used as the first word to describe a single quantity

Emirh
type: Concept
broader: Emir
definition: Infrared between 1.5 and 2 micron
pref label: em.IR.H
scope note: S: stands for only secondary: the word cannot be used as the first word to describe a single quantity

Emirj
type: Concept
broader: Emir
definition: Infrared between 1.0 and 1.5 micron
pref label: em.IR.J
scope note: S: stands for only secondary: the word cannot be used as the first word to describe a single quantity

Emirk
type: Concept
broader: Emir
definition: Infrared between 2 and 3 micron
pref label: em.IR.K
scope note: S: stands for only secondary: the word cannot be used as the first word to describe a single quantity

Emirmir
type: Concept
broader: Emir
definition: Medium-Infrared, 5-30 microns
pref label: em.IR.MIR
scope note: S: stands for only secondary: the word cannot be used as the first word to describe a single quantity

Emirnir
type: Concept
broader: Emir
definition: Near-Infrared, 1-5 microns
pref label: em.IR.NIR
scope note: S: stands for only secondary: the word cannot be used as the first word to describe a single quantity

Emline
type: Concept
broader: Em
definition: Designation of major atomic lines
narrower: Emlinebrgamma
narrower: Emlineco
narrower: Emlinehalpha
narrower: Emlinehbeta
narrower: Emlinehdelta
narrower: Emlinehgamma
narrower: Emlinehi
narrower: Emlinelyalpha
narrower: Emlineoiii
pref label: em.line
scope note: S: stands for only secondary: the word cannot be used as the first word to describe a single quantity

Emlinebrgamma
type: Concept
broader: Emline
definition: Bracket gamma line
pref label: em.line.Brgamma
scope note: S: stands for only secondary: the word cannot be used as the first word to describe a single quantity

Emlineco
type: Concept
broader: Emline
definition: CO radio line, e.g. 12CO(1-0) rest wl 115GHz
pref label: em.line.CO
scope note: S: stands for only secondary: the word cannot be used as the first word to describe a single quantity

Emlinehalpha
type: Concept
broader: Emline
definition: H-alpha line
pref label: em.line.Halpha
scope note: S: stands for only secondary: the word cannot be used as the first word to describe a single quantity

Emlinehbeta
type: Concept
broader: Emline
definition: H-beta line
pref label: em.line.Hbeta
scope note: S: stands for only secondary: the word cannot be used as the first word to describe a single quantity

Emlinehdelta
type: Concept
broader: Emline
definition: H-delta line
pref label: em.line.Hdelta
scope note: S: stands for only secondary: the word cannot be used as the first word to describe a single quantity

Emlinehgamma
type: Concept
broader: Emline
definition: H-gamma line
pref label: em.line.Hgamma
scope note: S: stands for only secondary: the word cannot be used as the first word to describe a single quantity

Emlinehi
type: Concept
broader: Emline
definition: 21cm hydrogen line
pref label: em.line.HI
scope note: S: stands for only secondary: the word cannot be used as the first word to describe a single quantity

Emlinelyalpha
type: Concept
broader: Emline
definition: H-Lyalpha line
pref label: em.line.Lyalpha
scope note: S: stands for only secondary: the word cannot be used as the first word to describe a single quantity

Emlineoiii
type: Concept
broader: Emline
definition: [OIII] line whose rest wl is 500.7 nm
pref label: em.line.OIII
scope note: S: stands for only secondary: the word cannot be used as the first word to describe a single quantity

Emmm
type: Concept
broader: Em
definition: Millimetric/submillimetric part of the spectrum
narrower: Emmm100200ghz
narrower: Emmm15003000ghz
narrower: Emmm200400ghz
narrower: Emmm3050ghz
narrower: Emmm400750ghz
narrower: Emmm50100ghz
narrower: Emmm7501500ghz
pref label: em.mm
scope note: S: stands for only secondary: the word cannot be used as the first word to describe a single quantity

Emmm100200ghz
type: Concept
broader: Emmm
definition: Millimetric between 100 and 200 GHz
pref label: em.mm.100-200GHz
scope note: S: stands for only secondary: the word cannot be used as the first word to describe a single quantity

Emmm15003000ghz
type: Concept
broader: Emmm
definition: Millimetric between 1500 and 3000 GHz
pref label: em.mm.1500-3000GHz
scope note: S: stands for only secondary: the word cannot be used as the first word to describe a single quantity

Emmm200400ghz
type: Concept
broader: Emmm
definition: Millimetric between 200 and 400 GHz
pref label: em.mm.200-400GHz
scope note: S: stands for only secondary: the word cannot be used as the first word to describe a single quantity

Emmm3050ghz
type: Concept
broader: Emmm
definition: Millimetric between 30 and 50 GHz
pref label: em.mm.30-50GHz
scope note: S: stands for only secondary: the word cannot be used as the first word to describe a single quantity

Emmm400750ghz
type: Concept
broader: Emmm
definition: Millimetric between 400 and 750 GHz
pref label: em.mm.400-750GHz
scope note: S: stands for only secondary: the word cannot be used as the first word to describe a single quantity

Emmm50100ghz
type: Concept
broader: Emmm
definition: Millimetric between 50 and 100 GHz
pref label: em.mm.50-100GHz
scope note: S: stands for only secondary: the word cannot be used as the first word to describe a single quantity

Emmm7501500ghz
type: Concept
broader: Emmm
definition: Millimetric between 750 and 1500 GHz
pref label: em.mm.750-1500GHz
scope note: S: stands for only secondary: the word cannot be used as the first word to describe a single quantity

Emopt
type: Concept
broader: Em
definition: Optical part of the spectrum
narrower: Emoptb
narrower: Emopti
narrower: Emoptr
narrower: Emoptu
narrower: Emoptv
pref label: em.opt
scope note: S: stands for only secondary: the word cannot be used as the first word to describe a single quantity

Emoptb
type: Concept
broader: Emopt
definition: Optical band between 400 and 500 nm
pref label: em.opt.B
scope note: S: stands for only secondary: the word cannot be used as the first word to describe a single quantity

Emopti
type: Concept
broader: Emopt
definition: Optical band between 750 and 1000 nm
pref label: em.opt.I
scope note: S: stands for only secondary: the word cannot be used as the first word to describe a single quantity

Emoptr
type: Concept
broader: Emopt
definition: Optical band between 600 and 750 nm
pref label: em.opt.R
scope note: S: stands for only secondary: the word cannot be used as the first word to describe a single quantity

Emoptu
type: Concept
broader: Emopt
definition: Optical band between 300 and 400 nm
pref label: em.opt.U
scope note: S: stands for only secondary: the word cannot be used as the first word to describe a single quantity

Emoptv
type: Concept
broader: Emopt
definition: Optical band between 500 and 600 nm
pref label: em.opt.V
scope note: S: stands for only secondary: the word cannot be used as the first word to describe a single quantity

Emradio
type: Concept
broader: Em
definition: Radio part of the spectrum
narrower: Emradio100200mhz
narrower: Emradio1230ghz
narrower: Emradio15003000mhz
narrower: Emradio200400mhz
narrower: Emradio20100mhz
narrower: Emradio36ghz
narrower: Emradio400750mhz
narrower: Emradio612ghz
narrower: Emradio7501500mhz
pref label: em.radio
scope note: S: stands for only secondary: the word cannot be used as the first word to describe a single quantity

Emradio100200mhz
type: Concept
broader: Emradio
definition: Radio between 100 and 200 MHz
pref label: em.radio.100-200MHz
scope note: S: stands for only secondary: the word cannot be used as the first word to describe a single quantity

Emradio1230ghz
type: Concept
broader: Emradio
definition: Radio between 12 and 30 GHz
pref label: em.radio.12-30GHz
scope note: S: stands for only secondary: the word cannot be used as the first word to describe a single quantity

Emradio15003000mhz
type: Concept
broader: Emradio
definition: Radio between 1500 and 3000 MHz
pref label: em.radio.1500-3000MHz
scope note: S: stands for only secondary: the word cannot be used as the first word to describe a single quantity

Emradio200400mhz
type: Concept
broader: Emradio
definition: Radio between 200 and 400 MHz
pref label: em.radio.200-400MHz
scope note: S: stands for only secondary: the word cannot be used as the first word to describe a single quantity

Emradio20100mhz
type: Concept
broader: Emradio
definition: Radio between 20 and 100 MHz
pref label: em.radio.20-100MHz
scope note: S: stands for only secondary: the word cannot be used as the first word to describe a single quantity

Emradio36ghz
type: Concept
broader: Emradio
definition: Radio between 3 and 6 GHz
pref label: em.radio.3-6GHz
scope note: S: stands for only secondary: the word cannot be used as the first word to describe a single quantity

Emradio400750mhz
type: Concept
broader: Emradio
definition: Radio between 400 and 750 MHz
pref label: em.radio.400-750MHz
scope note: S: stands for only secondary: the word cannot be used as the first word to describe a single quantity

Emradio612ghz
type: Concept
broader: Emradio
definition: Radio between 6 and 12 GHz
pref label: em.radio.6-12GHz
scope note: S: stands for only secondary: the word cannot be used as the first word to describe a single quantity

Emradio7501500mhz
type: Concept
broader: Emradio
definition: Radio between 750 and 1500 MHz
pref label: em.radio.750-1500MHz
scope note: S: stands for only secondary: the word cannot be used as the first word to describe a single quantity

Emuv
type: Concept
broader: Em
definition: Ultraviolet part of the spectrum
narrower: Emuv100200nm
narrower: Emuv1050nm
narrower: Emuv200300nm
narrower: Emuv50100nm
narrower: Emuvfuv
pref label: em.UV
scope note: S: stands for only secondary: the word cannot be used as the first word to describe a single quantity

Emuv100200nm
type: Concept
broader: Emuv
definition: Ultraviolet between 100 and 200 nm
pref label: em.UV.100-200nm
scope note: S: stands for only secondary: the word cannot be used as the first word to describe a single quantity

Emuv1050nm
type: Concept
broader: Emuv
definition: Ultraviolet between 10 and 50 nm
pref label: em.UV.10-50nm
scope note: S: stands for only secondary: the word cannot be used as the first word to describe a single quantity

Emuv200300nm
type: Concept
broader: Emuv
definition: Ultraviolet between 200 and 300 nm
pref label: em.UV.200-300nm
scope note: S: stands for only secondary: the word cannot be used as the first word to describe a single quantity

Emuv50100nm
type: Concept
broader: Emuv
definition: Ultraviolet between 50 and 100 nm
pref label: em.UV.50-100nm
scope note: S: stands for only secondary: the word cannot be used as the first word to describe a single quantity

Emuvfuv
type: Concept
broader: Emuv
definition: Far-Ultraviolet
pref label: em.UV.FUV
scope note: S: stands for only secondary: the word cannot be used as the first word to describe a single quantity

Emwavenumber
type: Concept
broader: Em
definition: Wavenumber value in the em frame
pref label: em.wavenumber
scope note: Q: means that the word can be used indifferently as first or secondary word

Emwl
type: Concept
broader: Em
definition: Wavelength value in the em frame
narrower: Emwlcentral
narrower: Emwleffective
pref label: em.wl
scope note: Q: means that the word can be used indifferently as first or secondary word

Emwlcentral
type: Concept
broader: Emwl
definition: Central wavelength
pref label: em.wl.central
scope note: Q: means that the word can be used indifferently as first or secondary word

Emwleffective
type: Concept
broader: Emwl
definition: Effective wavelength
pref label: em.wl.effective
scope note: Q: means that the word can be used indifferently as first or secondary word

Emxray
type: Concept
broader: Em
definition: X-ray part of the spectrum
narrower: Emxrayhard
narrower: Emxraymedium
narrower: Emxraysoft
pref label: em.X-ray
scope note: S: stands for only secondary: the word cannot be used as the first word to describe a single quantity

Emxrayhard
type: Concept
broader: Emxray
definition: Hard X-ray (12 - 120 keV)
pref label: em.X-ray.hard
scope note: S: stands for only secondary: the word cannot be used as the first word to describe a single quantity

Emxraymedium
type: Concept
broader: Emxray
definition: Medium X-ray (2 - 12 keV)
pref label: em.X-ray.medium
scope note: S: stands for only secondary: the word cannot be used as the first word to describe a single quantity

Emxraysoft
type: Concept
broader: Emxray
definition: Soft X-ray (0.12 - 2 keV)
pref label: em.X-ray.soft
scope note: S: stands for only secondary: the word cannot be used as the first word to describe a single quantity

Instr
type: Concept
definition: Instrument
narrower: Instrbackground
narrower: Instrbandpass
narrower: Instrbandwidth
narrower: Instrbaseline
narrower: Instrbeam
narrower: Instrcalib
narrower: Instrdet
narrower: Instrdispersion
narrower: Instrfilter
narrower: Instrfov
narrower: Instrobsty
narrower: Instroffset
narrower: Instrorder
narrower: Instrparam
narrower: Instrpixel
narrower: Instrplate
narrower: Instrprecision
narrower: Instrsaturation
narrower: Instrscale
narrower: Instrsensitivity
narrower: Instrsetup
narrower: Instrskylevel
narrower: Instrskytemp
narrower: Instrtel
pref label: instr
scope note: Q: means that the word can be used indifferently as first or secondary word

Instrbackground
type: Concept
broader: Instr
definition: Instrumental background
pref label: instr.background
scope note: E: means a photometric quantity, and can be followed by a word describing a part of the electromagnetic spectrum

Instrbandpass
type: Concept
broader: Instr
definition: Bandpass (e.g.: band name) of instrument
pref label: instr.bandpass
scope note: Q: means that the word can be used indifferently as first or secondary word

Instrbandwidth
type: Concept
broader: Instr
definition: Bandwidth of the instrument
pref label: instr.bandwidth
scope note: Q: means that the word can be used indifferently as first or secondary word

Instrbaseline
type: Concept
broader: Instr
definition: Baseline for interferometry
pref label: instr.baseline
scope note: Q: means that the word can be used indifferently as first or secondary word

Instrbeam
type: Concept
broader: Instr
definition: Beam
pref label: instr.beam
scope note: S: stands for only secondary: the word cannot be used as the first word to describe a single quantity

Instrcalib
type: Concept
broader: Instr
definition: Calibration parameter
pref label: instr.calib
scope note: Q: means that the word can be used indifferently as first or secondary word

Instrdet
type: Concept
broader: Instr
definition: Detector
narrower: Instrdetnoise
narrower: Instrdetpsf
narrower: Instrdetqe
pref label: instr.det
scope note: S: stands for only secondary: the word cannot be used as the first word to describe a single quantity

Instrdetnoise
type: Concept
broader: Instrdet
definition: Instrument noise
pref label: instr.det.noise
scope note: Q: means that the word can be used indifferently as first or secondary word

Instrdetpsf
type: Concept
broader: Instrdet
definition: Point Spread Function
pref label: instr.det.psf
scope note: Q: means that the word can be used indifferently as first or secondary word

Instrdetqe
type: Concept
broader: Instrdet
definition: Quantum efficiency
pref label: instr.det.qe
scope note: Q: means that the word can be used indifferently as first or secondary word

Instrdispersion
type: Concept
broader: Instr
definition: Dispersion of a spectrograph
pref label: instr.dispersion
scope note: Q: means that the word can be used indifferently as first or secondary word

Instrfilter
type: Concept
broader: Instr
definition: Filter
pref label: instr.filter
scope note: S: stands for only secondary: the word cannot be used as the first word to describe a single quantity

Instrfov
type: Concept
broader: Instr
definition: Field of view
pref label: instr.fov
scope note: S: stands for only secondary: the word cannot be used as the first word to describe a single quantity

Instrobsty
type: Concept
broader: Instr
definition: Observatory, satellite, mission
narrower: Instrobstyseeing
pref label: instr.obsty
scope note: S: stands for only secondary: the word cannot be used as the first word to describe a single quantity

Instrobstyseeing
type: Concept
broader: Instrobsty
definition: Seeing
pref label: instr.obsty.seeing
scope note: Q: means that the word can be used indifferently as first or secondary word

Instroffset
type: Concept
broader: Instr
definition: Offset angle respect to main direction of observation
pref label: instr.offset
scope note: Q: means that the word can be used indifferently as first or secondary word

Instrorder
type: Concept
broader: Instr
definition: Spectral order in a spectrograph
pref label: instr.order
scope note: Q: means that the word can be used indifferently as first or secondary word

Instrparam
type: Concept
broader: Instr
definition: Various instrumental parameters
pref label: instr.param
scope note: Q: means that the word can be used indifferently as first or secondary word

Instrpixel
type: Concept
broader: Instr
definition: Pixel (default size: angular)
pref label: instr.pixel
scope note: S: stands for only secondary: the word cannot be used as the first word to describe a single quantity

Instrplate
type: Concept
broader: Instr
definition: Photographic plate
narrower: Instrplateemulsion
pref label: instr.plate
scope note: S: stands for only secondary: the word cannot be used as the first word to describe a single quantity

Instrplateemulsion
type: Concept
broader: Instrplate
definition: Plate emulsion
pref label: instr.plate.emulsion
scope note: Q: means that the word can be used indifferently as first or secondary word

Instrprecision
type: Concept
broader: Instr
definition: Instrument precision
pref label: instr.precision
scope note: Q: means that the word can be used indifferently as first or secondary word

Instrsaturation
type: Concept
broader: Instr
definition: Instrument saturation threshold
pref label: instr.saturation
scope note: Q: means that the word can be used indifferently as first or secondary word

Instrscale
type: Concept
broader: Instr
definition: Instrument scale (for CCD, plate, image)
pref label: instr.scale
scope note: Q: means that the word can be used indifferently as first or secondary word

Instrsensitivity
type: Concept
broader: Instr
definition: Instrument sensitivity, detection threshold
pref label: instr.sensitivity
scope note: Q: means that the word can be used indifferently as first or secondary word

Instrsetup
type: Concept
broader: Instr
definition: Instrument configuration or setup
pref label: instr.setup
scope note: Q: means that the word can be used indifferently as first or secondary word

Instrskylevel
type: Concept
broader: Instr
definition: Sky level
pref label: instr.skyLevel
scope note: Q: means that the word can be used indifferently as first or secondary word

Instrskytemp
type: Concept
broader: Instr
definition: Sky temperature
pref label: instr.skyTemp
scope note: Q: means that the word can be used indifferently as first or secondary word

Instrtel
type: Concept
broader: Instr
definition: Telescope
narrower: Instrtelfocallength
pref label: instr.tel
scope note: Q: means that the word can be used indifferently as first or secondary word

Instrtelfocallength
type: Concept
broader: Instrtel
definition: Telescope focal length
pref label: instr.tel.focalLength
scope note: Q: means that the word can be used indifferently as first or secondary word

Meta
type: Concept
definition: Metadata
narrower: Metaabstract
narrower: Metabib
narrower: Metacode
narrower: Metacryptic
narrower: Metacuration
narrower: Metadataset
narrower: Metaemail
narrower: Metafile
narrower: Metafits
narrower: Metaid
narrower: Metamain
narrower: Metamodelled
narrower: Metanote
narrower: Metanumber
narrower: Metarecord
narrower: Metaref
narrower: Metasoftware
narrower: Metatable
narrower: Metatitle
narrower: Metaucd
narrower: Metaunit
narrower: Metaversion
pref label: meta
scope note: P: means that the word can only be used as primary or first word

Metaabstract
type: Concept
broader: Meta
definition: Abstract (of paper, proposal,etc.)
pref label: meta.abstract
scope note: P: means that the word can only be used as primary or first word

Metabib
type: Concept
broader: Meta
definition: Bibliographic reference
narrower: Metabibauthor
narrower: Metabibbibcode
narrower: Metabibfig
narrower: Metabibjournal
narrower: Metabibpage
narrower: Metabibvolume
pref label: meta.bib
scope note: P: means that the word can only be used as primary or first word

Metabibauthor
type: Concept
broader: Metabib
definition: Author name
pref label: meta.bib.author
scope note: P: means that the word can only be used as primary or first word

Metabibbibcode
type: Concept
broader: Metabib
definition: Bibcode
pref label: meta.bib.bibcode
scope note: P: means that the word can only be used as primary or first word

Metabibfig
type: Concept
broader: Metabib
definition: Figure in a paper
pref label: meta.bib.fig
scope note: P: means that the word can only be used as primary or first word

Metabibjournal
type: Concept
broader: Metabib
definition: Journal name
pref label: meta.bib.journal
scope note: P: means that the word can only be used as primary or first word

Metabibpage
type: Concept
broader: Metabib
definition: Page number
pref label: meta.bib.page
scope note: P: means that the word can only be used as primary or first word

Metabibvolume
type: Concept
broader: Metabib
definition: Volume number
pref label: meta.bib.volume
scope note: P: means that the word can only be used as primary or first word

Metacode
type: Concept
broader: Meta
definition: Code or flag
narrower: Metacodeclass
narrower: Metacodeerror
narrower: Metacodemember
narrower: Metacodemime
narrower: Metacodemultip
narrower: Metacodequal
narrower: Metacodestatus
pref label: meta.code
scope note: P: means that the word can only be used as primary or first word

Metacodeclass
type: Concept
broader: Metacode
definition: Classification code
pref label: meta.code.class
scope note: P: means that the word can only be used as primary or first word

Metacodeerror
type: Concept
broader: Metacode
definition: limit uncertainty error flag
pref label: meta.code.error
scope note: P: means that the word can only be used as primary or first word

Metacodemember
type: Concept
broader: Metacode
definition: Membership code
pref label: meta.code.member
scope note: P: means that the word can only be used as primary or first word

Metacodemime
type: Concept
broader: Metacode
definition: MIME type
pref label: meta.code.mime
scope note: P: means that the word can only be used as primary or first word

Metacodemultip
type: Concept
broader: Metacode
definition: Multiplicity or binarity flag
pref label: meta.code.multip
scope note: P: means that the word can only be used as primary or first word

Metacodequal
type: Concept
broader: Metacode
definition: Quality, precision, reliability flag or code
pref label: meta.code.qual
scope note: P: means that the word can only be used as primary or first word

Metacodestatus
type: Concept
broader: Metacode
definition: Status code (e.g.: status of a proposal/observation)
pref label: meta.code.status
scope note: P: means that the word can only be used as primary or first word

Metacryptic
type: Concept
broader: Meta
definition: Unknown or impossible to understand quantity
pref label: meta.cryptic
scope note: P: means that the word can only be used as primary or first word

Metacuration
type: Concept
broader: Meta
definition: Identity of man/organization responsible for the data
pref label: meta.curation
scope note: P: means that the word can only be used as primary or first word

Metadataset
type: Concept
broader: Meta
definition: Dataset
pref label: meta.dataset
scope note: Q: means that the word can be used indifferently as first or secondary word

Metaemail
type: Concept
broader: Meta
definition: Curation/contact e-mail
pref label: meta.email
scope note: Q: means that the word can be used indifferently as first or secondary word

Metafile
type: Concept
broader: Meta
definition: File
pref label: meta.file
scope note: S: stands for only secondary: the word cannot be used as the first word to describe a single quantity

Metafits
type: Concept
broader: Meta
definition: FITS standard
pref label: meta.fits
scope note: S: stands for only secondary: the word cannot be used as the first word to describe a single quantity

Metaid
type: Concept
broader: Meta
definition: Identifier, name or designation
narrower: Metaidassoc
narrower: Metaidcoi
narrower: Metaidcross
narrower: Metaidparent
narrower: Metaidpart
narrower: Metaidpi
pref label: meta.id
scope note: P: means that the word can only be used as primary or first word

Metaidassoc
type: Concept
broader: Metaid
definition: Identifier of associated counterpart
pref label: meta.id.assoc
scope note: P: means that the word can only be used as primary or first word

Metaidcoi
type: Concept
broader: Metaid
definition: Name of Co-Investigator
pref label: meta.id.CoI
scope note: P: means that the word can only be used as primary or first word

Metaidcross
type: Concept
broader: Metaid
definition: Cross identification
pref label: meta.id.cross
scope note: P: means that the word can only be used as primary or first word

Metaidparent
type: Concept
broader: Metaid
definition: Identification of parent source
pref label: meta.id.parent
scope note: P: means that the word can only be used as primary or first word

Metaidpart
type: Concept
broader: Metaid
definition: Part of identifier, suffix or sub-component
pref label: meta.id.part
scope note: P: means that the word can only be used as primary or first word

Metaidpi
type: Concept
broader: Metaid
definition: Name of Principal Investigator
pref label: meta.id.PI
scope note: P: means that the word can only be used as primary or first word

Metamain
type: Concept
broader: Meta
definition: Main value of something
pref label: meta.main
scope note: S: stands for only secondary: the word cannot be used as the first word to describe a single quantity

Metamodelled
type: Concept
broader: Meta
definition: Quantity was produced by a model
pref label: meta.modelled
scope note: S: stands for only secondary: the word cannot be used as the first word to describe a single quantity

Metanote
type: Concept
broader: Meta
definition: Note or remark (longer than a code or flag)
pref label: meta.note
scope note: P: means that the word can only be used as primary or first word

Metanumber
type: Concept
broader: Meta
definition: Number (of things; e.g. nb of object in an image)
pref label: meta.number
scope note: P: means that the word can only be used as primary or first word

Metarecord
type: Concept
broader: Meta
definition: Record number
pref label: meta.record
scope note: P: means that the word can only be used as primary or first word

Metaref
type: Concept
broader: Meta
definition: Reference, or origin
narrower: Metarefivorn
narrower: Metarefuri
narrower: Metarefurl
pref label: meta.ref
scope note: P: means that the word can only be used as primary or first word

Metarefivorn
type: Concept
broader: Metaref
definition: IVORN, Int. VO Resource Name (ivo://)
pref label: meta.ref.ivorn
scope note: Q: means that the word can be used indifferently as first or secondary word

Metarefuri
type: Concept
broader: Metaref
definition: URI, universal resource identifier
pref label: meta.ref.uri
scope note: Q: means that the word can be used indifferently as first or secondary word

Metarefurl
type: Concept
broader: Metaref
definition: URL, web address
pref label: meta.ref.url
scope note: P: means that the word can only be used as primary or first word

Metasoftware
type: Concept
broader: Meta
definition: Software used in generating data
pref label: meta.software
scope note: S: stands for only secondary: the word cannot be used as the first word to describe a single quantity

Metatable
type: Concept
broader: Meta
definition: Table or catalogue
pref label: meta.table
scope note: S: stands for only secondary: the word cannot be used as the first word to describe a single quantity

Metatitle
type: Concept
broader: Meta
definition: Title or explanation
pref label: meta.title
scope note: P: means that the word can only be used as primary or first word

Metaucd
type: Concept
broader: Meta
definition: UCD
pref label: meta.ucd
scope note: Q: means that the word can be used indifferently as first or secondary word

Metaunit
type: Concept
broader: Meta
definition: Unit
pref label: meta.unit
scope note: P: means that the word can only be used as primary or first word

Metaversion
type: Concept
broader: Meta
definition: Version
pref label: meta.version
scope note: P: means that the word can only be used as primary or first word

Obs
type: Concept
definition: Observation
narrower: Obsairmass
narrower: Obsatmos
narrower: Obscalib
narrower: Obsexposure
narrower: Obsfield
narrower: Obsimage
narrower: Obsobserver
narrower: Obsparam
narrower: Obsproposal
narrower: Obssequence
pref label: obs
scope note: S: stands for only secondary: the word cannot be used as the first word to describe a single quantity

Obsairmass
type: Concept
broader: Obs
definition: Airmass
pref label: obs.airMass
scope note: Q: means that the word can be used indifferently as first or secondary word

Obsatmos
type: Concept
broader: Obs
definition: Atmosphere, atmospheric phenomena affecting an observation
narrower: Obsatmosextinction
narrower: Obsatmosrefractangle
pref label: obs.atmos
scope note: S: stands for only secondary: the word cannot be used as the first word to describe a single quantity

Obsatmosextinction
type: Concept
broader: Obsatmos
definition: Atmospheric extinction
pref label: obs.atmos.extinction
scope note: Q: means that the word can be used indifferently as first or secondary word

Obsatmosrefractangle
type: Concept
broader: Obsatmos
definition: Atmospheric refraction angle
pref label: obs.atmos.refractAngle
scope note: Q: means that the word can be used indifferently as first or secondary word

Obscalib
type: Concept
broader: Obs
definition: Calibration observation
narrower: Obscalibflat
pref label: obs.calib
scope note: S: stands for only secondary: the word cannot be used as the first word to describe a single quantity

Obscalibflat
type: Concept
broader: Obscalib
definition: Related to flat-field calibration observation (dome, sky, ..)
pref label: obs.calib.flat
scope note: S: stands for only secondary: the word cannot be used as the first word to describe a single quantity

Obsexposure
type: Concept
broader: Obs
definition: Exposure
pref label: obs.exposure
scope note: S: stands for only secondary: the word cannot be used as the first word to describe a single quantity

Obsfield
type: Concept
broader: Obs
definition: Region covered by the observation
pref label: obs.field
scope note: S: stands for only secondary: the word cannot be used as the first word to describe a single quantity

Obsimage
type: Concept
broader: Obs
definition: Image
pref label: obs.image
scope note: S: stands for only secondary: the word cannot be used as the first word to describe a single quantity

Obsobserver
type: Concept
broader: Obs
definition: Observer, discoverer
pref label: obs.observer
scope note: Q: means that the word can be used indifferently as first or secondary word

Obsparam
type: Concept
broader: Obs
definition: Various observation or reduction parameter
pref label: obs.param
scope note: Q: means that the word can be used indifferently as first or secondary word

Obsproposal
type: Concept
broader: Obs
definition: Observation proposal
narrower: Obsproposalcycle
pref label: obs.proposal
scope note: S: stands for only secondary: the word cannot be used as the first word to describe a single quantity

Obsproposalcycle
type: Concept
broader: Obsproposal
definition: Proposal cycle
pref label: obs.proposal.cycle
scope note: Q: means that the word can be used indifferently as first or secondary word

Obssequence
type: Concept
broader: Obs
definition: Sequence of observations, exposures or events
pref label: obs.sequence
scope note: S: stands for only secondary: the word cannot be used as the first word to describe a single quantity

Phot
type: Concept
definition: Photometry
narrower: Photantennatemp
narrower: Photcalib
narrower: Photcolor
narrower: Photcount
narrower: Photfluence
narrower: Photflux
narrower: Photlimbdark
narrower: Photmag
pref label: phot
scope note: E: means a photometric quantity, and can be followed by a word describing a part of the electromagnetic spectrum

Photantennatemp
type: Concept
broader: Phot
definition: Antenna temperature
pref label: phot.antennaTemp
scope note: E: means a photometric quantity, and can be followed by a word describing a part of the electromagnetic spectrum

Photcalib
type: Concept
broader: Phot
definition: Photometric calibration
pref label: phot.calib
scope note: Q: means that the word can be used indifferently as first or secondary word

Photcolor
type: Concept
broader: Phot
definition: Color index or magnitude difference
narrower: Photcolorexcess
narrower: Photcolorreddfree
pref label: phot.color
scope note: C: is a colour index, and can be followed by two successive word describing a part of the electromagnetic spectrum

Photcolorexcess
type: Concept
broader: Photcolor
definition: color excess
pref label: phot.color.excess
scope note: Q: means that the word can be used indifferently as first or secondary word

Photcolorreddfree
type: Concept
broader: Photcolor
definition: Dereddened color
pref label: phot.color.reddFree
scope note: Q: means that the word can be used indifferently as first or secondary word

Photcount
type: Concept
broader: Phot
definition: Flux expressed in counts
pref label: phot.count
scope note: E: means a photometric quantity, and can be followed by a word describing a part of the electromagnetic spectrum

Photfluence
type: Concept
broader: Phot
definition: fluence
pref label: phot.fluence
scope note: E: means a photometric quantity, and can be followed by a word describing a part of the electromagnetic spectrum

Photflux
type: Concept
broader: Phot
definition: Photon flux
narrower: Photfluxbol
narrower: Photfluxdensity
narrower: Photfluxsb
pref label: phot.flux
scope note: E: means a photometric quantity, and can be followed by a word describing a part of the electromagnetic spectrum

Photfluxbol
type: Concept
broader: Photflux
definition: Bolometric flux
pref label: phot.flux.bol
scope note: Q: means that the word can be used indifferently as first or secondary word

Photfluxdensity
type: Concept
broader: Photflux
definition: Flux density (per wl/freq/energy interval)
narrower: Photfluxdensitysb
pref label: phot.flux.density
scope note: E: means a photometric quantity, and can be followed by a word describing a part of the electromagnetic spectrum

Photfluxdensitysb
type: Concept
broader: Photfluxdensity
definition: Flux density surface brightness
pref label: phot.flux.density.sb
scope note: E: means a photometric quantity, and can be followed by a word describing a part of the electromagnetic spectrum

Photfluxsb
type: Concept
broader: Photflux
definition: Flux surface brightness
pref label: phot.flux.sb
scope note: E: means a photometric quantity, and can be followed by a word describing a part of the electromagnetic spectrum

Photlimbdark
type: Concept
broader: Phot
definition: Limb-darkening coefficients
pref label: phot.limbDark
scope note: E: means a photometric quantity, and can be followed by a word describing a part of the electromagnetic spectrum

Photmag
type: Concept
broader: Phot
definition: Photometric magnitude
narrower: Photmagbc
narrower: Photmagbol
narrower: Photmagdistmod
narrower: Photmagreddfree
narrower: Photmagsb
pref label: phot.mag
scope note: E: means a photometric quantity, and can be followed by a word describing a part of the electromagnetic spectrum

Photmagbc
type: Concept
broader: Photmag
definition: Bolometric correction
pref label: phot.mag.bc
scope note: Q: means that the word can be used indifferently as first or secondary word

Photmagbol
type: Concept
broader: Photmag
definition: Bolometric magnitude
pref label: phot.mag.bol
scope note: Q: means that the word can be used indifferently as first or secondary word

Photmagdistmod
type: Concept
broader: Photmag
definition: Distance modulus
pref label: phot.mag.distMod
scope note: Q: means that the word can be used indifferently as first or secondary word

Photmagreddfree
type: Concept
broader: Photmag
definition: Dereddened magnitude
pref label: phot.mag.reddFree
scope note: E: means a photometric quantity, and can be followed by a word describing a part of the electromagnetic spectrum

Photmagsb
type: Concept
broader: Photmag
definition: Surface brightness in magnitude units
pref label: phot.mag.sb
scope note: E: means a photometric quantity, and can be followed by a word describing a part of the electromagnetic spectrum

Phys
type: Concept
definition: Physical quantities
narrower: Physabsorption
narrower: Physabund
narrower: Physacceleration
narrower: Physalbedo
narrower: Physangarea
narrower: Physangmomentum
narrower: Physangsize
narrower: Physarea
narrower: Physatmol
narrower: Physcolumndensity
narrower: Physcomposition
narrower: Physcosmology
narrower: Physdamping
narrower: Physdensity
narrower: Physdielectric
narrower: Physdispmeasure
narrower: Physelectfield
narrower: Physelectron
narrower: Physemissivity
narrower: Physemissmeasure
narrower: Physenergy
narrower: Physentropy
narrower: Physeos
narrower: Physexcitparam
narrower: Physgauntfactor
narrower: Physgravity
narrower: Physionizparam
narrower: Physluminosity
narrower: Physmagabs
narrower: Physmagfield
narrower: Physmass
narrower: Physmol
narrower: Physparticleneutrino
narrower: Physpolarization
narrower: Physpressure
narrower: Physrecombinationcoeff
narrower: Physrefractindex
narrower: Physsfr
narrower: Physsize
narrower: Phystemperature
narrower: Phystransmission
narrower: Physveloc
narrower: Physvirial
pref label: phys
scope note: Q: means that the word can be used indifferently as first or secondary word

Physabsorption
type: Concept
broader: Phys
definition: Extinction or absorption along the line of sight
narrower: Physabsorptioncoeff
narrower: Physabsorptiongal
narrower: Physabsorptionopticaldepth
pref label: phys.absorption
scope note: E: means a photometric quantity, and can be followed by a word describing a part of the electromagnetic spectrum

Physabsorptioncoeff
type: Concept
broader: Physabsorption
definition: Absorption coefficient (e.g. in a spectral line)
pref label: phys.absorption.coeff
scope note: Q: means that the word can be used indifferently as first or secondary word

Physabsorptiongal
type: Concept
broader: Physabsorption
definition: Galactic extinction
pref label: phys.absorption.gal
scope note: Q: means that the word can be used indifferently as first or secondary word

Physabsorptionopticaldepth
type: Concept
broader: Physabsorption
definition: Optical depth
pref label: phys.absorption.opticalDepth
scope note: Q: means that the word can be used indifferently as first or secondary word

Physabund
type: Concept
broader: Phys
definition: Abundance
narrower: Physabundfe
narrower: Physabundx
narrower: Physabundy
narrower: Physabundz
pref label: phys.abund
scope note: Q: means that the word can be used indifferently as first or secondary word

Physabundfe
type: Concept
broader: Physabund
definition: Fe/H abundance
pref label: phys.abund.Fe
scope note: Q: means that the word can be used indifferently as first or secondary word

Physabundx
type: Concept
broader: Physabund
definition: Hydrogen abundance
pref label: phys.abund.X
scope note: Q: means that the word can be used indifferently as first or secondary word

Physabundy
type: Concept
broader: Physabund
definition: Helium abundance
pref label: phys.abund.Y
scope note: Q: means that the word can be used indifferently as first or secondary word

Physabundz
type: Concept
broader: Physabund
definition: Metallicity abundance
pref label: phys.abund.Z
scope note: Q: means that the word can be used indifferently as first or secondary word

Physacceleration
type: Concept
broader: Phys
definition: Acceleration
pref label: phys.acceleration
scope note: Q: means that the word can be used indifferently as first or secondary word

Physalbedo
type: Concept
broader: Phys
definition: Albedo or reflectance
pref label: phys.albedo
scope note: Q: means that the word can be used indifferently as first or secondary word

Physangarea
type: Concept
broader: Phys
definition: Angular area
pref label: phys.angArea
scope note: Q: means that the word can be used indifferently as first or secondary word

Physangmomentum
type: Concept
broader: Phys
definition: Angular momentum
pref label: phys.angMomentum
scope note: Q: means that the word can be used indifferently as first or secondary word

Physangsize
type: Concept
broader: Phys
definition: Angular size width diameter dimension extension major minor axis extraction radius
narrower: Physangsizesmajaxis
narrower: Physangsizesminaxis
pref label: phys.angSize
scope note: Q: means that the word can be used indifferently as first or secondary word

Physangsizesmajaxis
type: Concept
broader: Physangsize
definition: angular size extent or extension of semi-major axis
pref label: phys.angSize.smajAxis
scope note: Q: means that the word can be used indifferently as first or secondary word

Physangsizesminaxis
type: Concept
broader: Physangsize
definition: angular size extent or extension of semi-minor axis
pref label: phys.angSize.sminAxis
scope note: Q: means that the word can be used indifferently as first or secondary word

Physarea
type: Concept
broader: Phys
definition: Area (in linear units)
pref label: phys.area
scope note: Q: means that the word can be used indifferently as first or secondary word

Physatmol
type: Concept
broader: Phys
definition: Atomic and molecular physics (shared properties)
narrower: Physatmolbranchingratio
narrower: Physatmolcollisional
narrower: Physatmolcollstrength
narrower: Physatmolconfiguration
narrower: Physatmolcrosssection
narrower: Physatmolelement
narrower: Physatmolexcitation
narrower: Physatmolfinal
narrower: Physatmolinitial
narrower: Physatmolionization
narrower: Physatmolionstage
narrower: Physatmollande
narrower: Physatmollevel
narrower: Physatmollifetime
narrower: Physatmollineshift
narrower: Physatmolnumber
narrower: Physatmoloscstrength
narrower: Physatmolparity
narrower: Physatmolqn
narrower: Physatmolradiationtype
narrower: Physatmolsweight
narrower: Physatmolsymmetry
narrower: Physatmolterm
narrower: Physatmoltransition
narrower: Physatmoltransprob
narrower: Physatmolweight
narrower: Physatmolwoscstrength
pref label: phys.atmol
scope note: S: stands for only secondary: the word cannot be used as the first word to describe a single quantity

Physatmolbranchingratio
type: Concept
broader: Physatmol
definition: Branching ratio
pref label: phys.atmol.branchingRatio
scope note: Q: means that the word can be used indifferently as first or secondary word

Physatmolcollisional
type: Concept
broader: Physatmol
definition: Related to collisions
pref label: phys.atmol.collisional
scope note: Q: means that the word can be used indifferently as first or secondary word

Physatmolcollstrength
type: Concept
broader: Physatmol
definition: Collisional strength
pref label: phys.atmol.collStrength
scope note: Q: means that the word can be used indifferently as first or secondary word

Physatmolconfiguration
type: Concept
broader: Physatmol
definition: Configuration
pref label: phys.atmol.configuration
scope note: Q: means that the word can be used indifferently as first or secondary word

Physatmolcrosssection
type: Concept
broader: Physatmol
definition: Atomic / molecular cross-section
pref label: phys.atmol.crossSection
scope note: Q: means that the word can be used indifferently as first or secondary word

Physatmolelement
type: Concept
broader: Physatmol
definition: Element
pref label: phys.atmol.element
scope note: Q: means that the word can be used indifferently as first or secondary word

Physatmolexcitation
type: Concept
broader: Physatmol
definition: Atomic molecular excitation parameter
pref label: phys.atmol.excitation
scope note: Q: means that the word can be used indifferently as first or secondary word

Physatmolfinal
type: Concept
broader: Physatmol
definition: Quantity refers to atomic/molecular final/ground state, level, ecc.
pref label: phys.atmol.final
scope note: Q: means that the word can be used indifferently as first or secondary word

Physatmolinitial
type: Concept
broader: Physatmol
definition: Quantity refers to atomic/molecular initial state, level, ecc.
pref label: phys.atmol.initial
scope note: Q: means that the word can be used indifferently as first or secondary word

Physatmolionization
type: Concept
broader: Physatmol
definition: Related to ionization
pref label: phys.atmol.ionization
scope note: S: stands for only secondary: the word cannot be used as the first word to describe a single quantity

Physatmolionstage
type: Concept
broader: Physatmol
definition: Ion, ionization stage
pref label: phys.atmol.ionStage
scope note: Q: means that the word can be used indifferently as first or secondary word

Physatmollande
type: Concept
broader: Physatmol
definition: Lande factor
pref label: phys.atmol.lande
scope note: Q: means that the word can be used indifferently as first or secondary word

Physatmollevel
type: Concept
broader: Physatmol
definition: Atomic level
pref label: phys.atmol.level
scope note: S: stands for only secondary: the word cannot be used as the first word to describe a single quantity

Physatmollifetime
type: Concept
broader: Physatmol
definition: Lifetime of a level
pref label: phys.atmol.lifetime
scope note: Q: means that the word can be used indifferently as first or secondary word

Physatmollineshift
type: Concept
broader: Physatmol
definition: Line shifting coefficient
pref label: phys.atmol.lineShift
scope note: Q: means that the word can be used indifferently as first or secondary word

Physatmolnumber
type: Concept
broader: Physatmol
definition: Atomic number Z
pref label: phys.atmol.number
scope note: Q: means that the word can be used indifferently as first or secondary word

Physatmoloscstrength
type: Concept
broader: Physatmol
definition: Oscillator strength
pref label: phys.atmol.oscStrength
scope note: Q: means that the word can be used indifferently as first or secondary word

Physatmolparity
type: Concept
broader: Physatmol
definition: Parity
pref label: phys.atmol.parity
scope note: Q: means that the word can be used indifferently as first or secondary word

Physatmolqn
type: Concept
broader: Physatmol
definition: Quantum number
pref label: phys.atmol.qn
scope note: Q: means that the word can be used indifferently as first or secondary word

Physatmolradiationtype
type: Concept
broader: Physatmol
definition: Type of radiation characterizing atomic lines (electric dipole/quadrupole, magnetic dipole)
pref label: phys.atmol.radiationType
scope note: Q: means that the word can be used indifferently as first or secondary word

Physatmolsweight
type: Concept
broader: Physatmol
definition: Statistical weight
narrower: Physatmolsweightnuclear
pref label: phys.atmol.sWeight
scope note: Q: means that the word can be used indifferently as first or secondary word

Physatmolsweightnuclear
type: Concept
broader: Physatmolsweight
definition: Statistical weight for nuclear spin states
pref label: phys.atmol.sWeight.nuclear
scope note: Q: means that the word can be used indifferently as first or secondary word

Physatmolsymmetry
type: Concept
broader: Physatmol
definition: Type of nuclear spin symmetry
pref label: phys.atmol.symmetry
scope note: Q: means that the word can be used indifferently as first or secondary word

Physatmolterm
type: Concept
broader: Physatmol
definition: Atomic term
pref label: phys.atmol.term
scope note: Q: means that the word can be used indifferently as first or secondary word

Physatmoltransition
type: Concept
broader: Physatmol
definition: Transition between states
pref label: phys.atmol.transition
scope note: S: stands for only secondary: the word cannot be used as the first word to describe a single quantity

Physatmoltransprob
type: Concept
broader: Physatmol
definition: Transition probability, Einstein A coefficient
pref label: phys.atmol.transProb
scope note: Q: means that the word can be used indifferently as first or secondary word

Physatmolweight
type: Concept
broader: Physatmol
definition: Atomic weight
pref label: phys.atmol.weight
scope note: Q: means that the word can be used indifferently as first or secondary word

Physatmolwoscstrength
type: Concept
broader: Physatmol
definition: Weighted oscillator strength
pref label: phys.atmol.wOscStrength
scope note: Q: means that the word can be used indifferently as first or secondary word

Physcolumndensity
type: Concept
broader: Phys
definition: Column density
pref label: phys.columnDensity
scope note: Q: means that the word can be used indifferently as first or secondary word

Physcomposition
type: Concept
broader: Phys
definition: Quantities related to composition of objects
narrower: Physcompositionmasslightratio
narrower: Physcompositionyield
pref label: phys.composition
scope note: S: stands for only secondary: the word cannot be used as the first word to describe a single quantity

Physcompositionmasslightratio
type: Concept
broader: Physcomposition
definition: Mass to light ratio
pref label: phys.composition.massLightRatio
scope note: Q: means that the word can be used indifferently as first or secondary word

Physcompositionyield
type: Concept
broader: Physcomposition
definition: Mass yield
pref label: phys.composition.yield
scope note: Q: means that the word can be used indifferently as first or secondary word

Physcosmology
type: Concept
broader: Phys
definition: Related to cosmology
pref label: phys.cosmology
scope note: S: stands for only secondary: the word cannot be used as the first word to describe a single quantity

Physdamping
type: Concept
broader: Phys
definition: Generic damping quantities
pref label: phys.damping
scope note: Q: means that the word can be used indifferently as first or secondary word

Physdensity
type: Concept
broader: Phys
definition: Density (of mass, electron, ...)
pref label: phys.density
scope note: Q: means that the word can be used indifferently as first or secondary word

Physdielectric
type: Concept
broader: Phys
definition: Complex dielectric function
pref label: phys.dielectric
scope note: Q: means that the word can be used indifferently as first or secondary word

Physdispmeasure
type: Concept
broader: Phys
definition: Dispersion measure
pref label: phys.dispMeasure
scope note: Q: means that the word can be used indifferently as first or secondary word

Physelectfield
type: Concept
broader: Phys
definition: Electric field
pref label: phys.electField
scope note: V: stands for vector. Such a word can be followed by another describing the axis or reference frame in which the measurement is done

Physelectron
type: Concept
broader: Phys
definition: Electron
narrower: Physelectrondegen
pref label: phys.electron
scope note: S: stands for only secondary: the word cannot be used as the first word to describe a single quantity

Physelectrondegen
type: Concept
broader: Physelectron
definition: Electron degeneracy parameter
pref label: phys.electron.degen
scope note: Q: means that the word can be used indifferently as first or secondary word

Physemissivity
type: Concept
broader: Phys
definition: Emissivity
pref label: phys.emissivity
scope note: Q: means that the word can be used indifferently as first or secondary word

Physemissmeasure
type: Concept
broader: Phys
definition: Emission measure
pref label: phys.emissMeasure
scope note: Q: means that the word can be used indifferently as first or secondary word

Physenergy
type: Concept
broader: Phys
definition: Energy
narrower: Physenergydensity
pref label: phys.energy
scope note: Q: means that the word can be used indifferently as first or secondary word

Physenergydensity
type: Concept
broader: Physenergy
definition: Energy-density
pref label: phys.energy.density
scope note: Q: means that the word can be used indifferently as first or secondary word

Physentropy
type: Concept
broader: Phys
definition: Entropy
pref label: phys.entropy
scope note: Q: means that the word can be used indifferently as first or secondary word

Physeos
type: Concept
broader: Phys
definition: Equation of state
pref label: phys.eos
scope note: Q: means that the word can be used indifferently as first or secondary word

Physexcitparam
type: Concept
broader: Phys
definition: Excitation parameter U
pref label: phys.excitParam
scope note: Q: means that the word can be used indifferently as first or secondary word

Physgauntfactor
type: Concept
broader: Phys
definition: Gaunt factor/correction
pref label: phys.gauntFactor
scope note: Q: means that the word can be used indifferently as first or secondary word

Physgravity
type: Concept
broader: Phys
definition: Gravity
pref label: phys.gravity
scope note: Q: means that the word can be used indifferently as first or secondary word

Physionizparam
type: Concept
broader: Phys
definition: Ionization parameter
narrower: Physionizparamcoll
narrower: Physionizparamrad
pref label: phys.ionizParam
scope note: Q: means that the word can be used indifferently as first or secondary word

Physionizparamcoll
type: Concept
broader: Physionizparam
definition: Collisional ionization
pref label: phys.ionizParam.coll
scope note: Q: means that the word can be used indifferently as first or secondary word

Physionizparamrad
type: Concept
broader: Physionizparam
definition: Radiative ionization
pref label: phys.ionizParam.rad
scope note: Q: means that the word can be used indifferently as first or secondary word

Physluminosity
type: Concept
broader: Phys
definition: Luminosity
narrower: Physluminosityfun
pref label: phys.luminosity
scope note: E: means a photometric quantity, and can be followed by a word describing a part of the electromagnetic spectrum

Physluminosityfun
type: Concept
broader: Physluminosity
definition: Luminosity function
pref label: phys.luminosity.fun
scope note: Q: means that the word can be used indifferently as first or secondary word

Physmagabs
type: Concept
broader: Phys
definition: Absolute magnitude
narrower: Physmagabsbol
pref label: phys.magAbs
scope note: E: means a photometric quantity, and can be followed by a word describing a part of the electromagnetic spectrum

Physmagabsbol
type: Concept
broader: Physmagabs
definition: Bolometric absolute magnitude
pref label: phys.magAbs.bol
scope note: Q: means that the word can be used indifferently as first or secondary word

Physmagfield
type: Concept
broader: Phys
definition: Magnetic field
pref label: phys.magField
scope note: V: stands for vector. Such a word can be followed by another describing the axis or reference frame in which the measurement is done

Physmass
type: Concept
broader: Phys
definition: Mass
narrower: Physmassloss
pref label: phys.mass
scope note: Q: means that the word can be used indifferently as first or secondary word

Physmassloss
type: Concept
broader: Physmass
definition: Mass loss
pref label: phys.mass.loss
scope note: Q: means that the word can be used indifferently as first or secondary word

Physmol
type: Concept
broader: Phys
definition: Molecular data
narrower: Physmoldipole
narrower: Physmoldissociation
narrower: Physmolformationheat
narrower: Physmolquadrupole
narrower: Physmolrotation
narrower: Physmolvibration
pref label: phys.mol
scope note: Q: means that the word can be used indifferently as first or secondary word

Physmoldipole
type: Concept
broader: Physmol
definition: Molecular dipole
narrower: Physmoldipoleelectric
narrower: Physmoldipolemagnetic
pref label: phys.mol.dipole
scope note: Q: means that the word can be used indifferently as first or secondary word

Physmoldipoleelectric
type: Concept
broader: Physmoldipole
definition: Molecular electric dipole moment
pref label: phys.mol.dipole.electric
scope note: Q: means that the word can be used indifferently as first or secondary word

Physmoldipolemagnetic
type: Concept
broader: Physmoldipole
definition: Molecular magnetic dipole moment
pref label: phys.mol.dipole.magnetic
scope note: Q: means that the word can be used indifferently as first or secondary word

Physmoldissociation
type: Concept
broader: Physmol
definition: Molecular dissociation
pref label: phys.mol.dissociation
scope note: Q: means that the word can be used indifferently as first or secondary word

Physmolformationheat
type: Concept
broader: Physmol
definition: Formation heat for molecules
pref label: phys.mol.formationHeat
scope note: Q: means that the word can be used indifferently as first or secondary word

Physmolquadrupole
type: Concept
broader: Physmol
definition: Molecular quadrupole
narrower: Physmolquadrupoleelectric
pref label: phys.mol.quadrupole
scope note: Q: means that the word can be used indifferently as first or secondary word

Physmolquadrupoleelectric
type: Concept
broader: Physmolquadrupole
definition: Molecular electric quadrupole moment
pref label: phys.mol.quadrupole.electric
scope note: Q: means that the word can be used indifferently as first or secondary word

Physmolrotation
type: Concept
broader: Physmol
definition: Molecular rotation
pref label: phys.mol.rotation
scope note: S: stands for only secondary: the word cannot be used as the first word to describe a single quantity

Physmolvibration
type: Concept
broader: Physmol
definition: Molecular vibration
pref label: phys.mol.vibration
scope note: S: stands for only secondary: the word cannot be used as the first word to describe a single quantity

Physparticleneutrino
type: Concept
broader: Phys
definition: Related to neutrino
pref label: phys.particle.neutrino
scope note: S: stands for only secondary: the word cannot be used as the first word to describe a single quantity

Physpolarization
type: Concept
broader: Phys
definition: Polarization degree (or percentage)
narrower: Physpolarizationcircular
narrower: Physpolarizationlinear
narrower: Physpolarizationrotmeasure
narrower: Physpolarizationstokes
pref label: phys.polarization
scope note: E: means a photometric quantity, and can be followed by a word describing a part of the electromagnetic spectrum

Physpolarizationcircular
type: Concept
broader: Physpolarization
definition: Circular polarization
pref label: phys.polarization.circular
scope note: Q: means that the word can be used indifferently as first or secondary word

Physpolarizationlinear
type: Concept
broader: Physpolarization
definition: Linear polarization
pref label: phys.polarization.linear
scope note: Q: means that the word can be used indifferently as first or secondary word

Physpolarizationrotmeasure
type: Concept
broader: Physpolarization
definition: Rotation measure polarization
pref label: phys.polarization.rotMeasure
scope note: Q: means that the word can be used indifferently as first or secondary word

Physpolarizationstokes
type: Concept
broader: Physpolarization
definition: Stokes polarization
pref label: phys.polarization.stokes
scope note: Q: means that the word can be used indifferently as first or secondary word

Physpressure
type: Concept
broader: Phys
definition: Pressure
pref label: phys.pressure
scope note: Q: means that the word can be used indifferently as first or secondary word

Physrecombinationcoeff
type: Concept
broader: Phys
definition: Recombination coefficient
pref label: phys.recombination.coeff
scope note: Q: means that the word can be used indifferently as first or secondary word

Physrefractindex
type: Concept
broader: Phys
definition: Refraction index
pref label: phys.refractIndex
scope note: Q: means that the word can be used indifferently as first or secondary word

Physsfr
type: Concept
broader: Phys
definition: Star formation rate
pref label: phys.SFR
scope note: Q: means that the word can be used indifferently as first or secondary word

Physsize
type: Concept
broader: Phys
definition: Linear size, length (not angular)
narrower: Physsizeaxisratio
narrower: Physsizediameter
narrower: Physsizeradius
narrower: Physsizesmajaxis
narrower: Physsizesminaxis
pref label: phys.size
scope note: Q: means that the word can be used indifferently as first or secondary word

Physsizeaxisratio
type: Concept
broader: Physsize
definition: Axis ratio (a/b) or (b/a)
pref label: phys.size.axisRatio
scope note: Q: means that the word can be used indifferently as first or secondary word

Physsizediameter
type: Concept
broader: Physsize
definition: Linear diameter
pref label: phys.size.diameter
scope note: Q: means that the word can be used indifferently as first or secondary word

Physsizeradius
type: Concept
broader: Physsize
definition: Linear radius
pref label: phys.size.radius
scope note: Q: means that the word can be used indifferently as first or secondary word

Physsizesmajaxis
type: Concept
broader: Physsize
definition: Linear semi major axis
pref label: phys.size.smajAxis
scope note: Q: means that the word can be used indifferently as first or secondary word

Physsizesminaxis
type: Concept
broader: Physsize
definition: Linear semi minor axis
pref label: phys.size.sminAxis
scope note: Q: means that the word can be used indifferently as first or secondary word

Phystemperature
type: Concept
broader: Phys
definition: Temperature
narrower: Phystemperatureeffective
narrower: Phystemperatureelectron
pref label: phys.temperature
scope note: Q: means that the word can be used indifferently as first or secondary word

Phystemperatureeffective
type: Concept
broader: Phystemperature
definition: Effective temperature
pref label: phys.temperature.effective
scope note: Q: means that the word can be used indifferently as first or secondary word

Phystemperatureelectron
type: Concept
broader: Phystemperature
definition: Electron temperature
pref label: phys.temperature.electron
scope note: Q: means that the word can be used indifferently as first or secondary word

Phystransmission
type: Concept
broader: Phys
definition: Transmission (of filter, instrument, ...)
pref label: phys.transmission
scope note: Q: means that the word can be used indifferently as first or secondary word

Physveloc
type: Concept
broader: Phys
definition: Space velocity
narrower: Physvelocang
narrower: Physvelocdispersion
narrower: Physvelocescape
narrower: Physvelocexpansion
narrower: Physvelocmicroturb
narrower: Physvelocorbital
narrower: Physvelocpulsat
narrower: Physvelocrotat
narrower: Physveloctransverse
pref label: phys.veloc
scope note: V: stands for vector. Such a word can be followed by another describing the axis or reference frame in which the measurement is done

Physvelocang
type: Concept
broader: Physveloc
definition: Angular velocity
pref label: phys.veloc.ang
scope note: Q: means that the word can be used indifferently as first or secondary word

Physvelocdispersion
type: Concept
broader: Physveloc
definition: Velocity dispersion
pref label: phys.veloc.dispersion
scope note: Q: means that the word can be used indifferently as first or secondary word

Physvelocescape
type: Concept
broader: Physveloc
definition: Escape velocity
pref label: phys.veloc.escape
scope note: Q: means that the word can be used indifferently as first or secondary word

Physvelocexpansion
type: Concept
broader: Physveloc
definition: Expansion velocity
pref label: phys.veloc.expansion
scope note: Q: means that the word can be used indifferently as first or secondary word

Physvelocmicroturb
type: Concept
broader: Physveloc
definition: Microturbulence velocity
pref label: phys.veloc.microTurb
scope note: Q: means that the word can be used indifferently as first or secondary word

Physvelocorbital
type: Concept
broader: Physveloc
definition: Orbital velocity
pref label: phys.veloc.orbital
scope note: Q: means that the word can be used indifferently as first or secondary word

Physvelocpulsat
type: Concept
broader: Physveloc
definition: Pulsational velocity
pref label: phys.veloc.pulsat
scope note: Q: means that the word can be used indifferently as first or secondary word

Physvelocrotat
type: Concept
broader: Physveloc
definition: Rotational velocity
pref label: phys.veloc.rotat
scope note: Q: means that the word can be used indifferently as first or secondary word

Physveloctransverse
type: Concept
broader: Physveloc
definition: Transverse / tangential velocity
pref label: phys.veloc.transverse
scope note: Q: means that the word can be used indifferently as first or secondary word

Physvirial
type: Concept
broader: Phys
definition: Related to virial quantities (mass, radius, ..)
pref label: phys.virial
scope note: Q: means that the word can be used indifferently as first or secondary word

Pos
type: Concept
definition: Position and coordinates
narrower: Posangdistance
narrower: Posangresolution
narrower: Posaz
narrower: Posbarycenter
narrower: Posbodyrc
narrower: Poscartesian
narrower: Poscmb
narrower: Posdircos
narrower: Posdistance
narrower: Posearth
narrower: Posecliptic
narrower: Poseop
narrower: Posephem
narrower: Poseq
narrower: Poserrorellipse
narrower: Posframe
narrower: Posgalactic
narrower: Posgalactocentric
narrower: Posgeocentric
narrower: Poshealpix
narrower: Posheliocentric
narrower: Poshtm
narrower: Poslambert
narrower: Poslg
narrower: Poslsr
narrower: Poslunar
narrower: Posparallax
narrower: Posphaseang
narrower: Pospm
narrower: Posposang
narrower: Posprecess
narrower: Possupergalactic
narrower: Poswcs
pref label: pos
scope note: Q: means that the word can be used indifferently as first or secondary word

Posangdistance
type: Concept
broader: Pos
definition: Angular distance, elongation
pref label: pos.angDistance
scope note: Q: means that the word can be used indifferently as first or secondary word

Posangresolution
type: Concept
broader: Pos
definition: Angular resolution
pref label: pos.angResolution
scope note: Q: means that the word can be used indifferently as first or secondary word

Posaz
type: Concept
broader: Pos
definition: Position in alt-azimutal frame
narrower: Posazalt
narrower: Posazazi
narrower: Posazzd
pref label: pos.az
scope note: Q: means that the word can be used indifferently as first or secondary word

Posazalt
type: Concept
broader: Posaz
definition: Alt-azimutal altitude
pref label: pos.az.alt
scope note: Q: means that the word can be used indifferently as first or secondary word

Posazazi
type: Concept
broader: Posaz
definition: Alt-azimutal azimut
pref label: pos.az.azi
scope note: Q: means that the word can be used indifferently as first or secondary word

Posazzd
type: Concept
broader: Posaz
definition: Alt-azimutal zenith distance
pref label: pos.az.zd
scope note: Q: means that the word can be used indifferently as first or secondary word

Posbarycenter
type: Concept
broader: Pos
definition: Barycenter
pref label: pos.barycenter
scope note: S: stands for only secondary: the word cannot be used as the first word to describe a single quantity

Posbodyrc
type: Concept
broader: Pos
definition: Body related coordinates
narrower: Posbodyrcalt
narrower: Posbodyrclat
narrower: Posbodyrclong
pref label: pos.bodyrc
scope note: S: stands for only secondary: the word cannot be used as the first word to describe a single quantity

Posbodyrcalt
type: Concept
broader: Posbodyrc
definition: Body related coordinate (altitude on the body)
pref label: pos.bodyrc.alt
scope note: Q: means that the word can be used indifferently as first or secondary word

Posbodyrclat
type: Concept
broader: Posbodyrc
definition: Body related coordinate (latitude on the body)
pref label: pos.bodyrc.lat
scope note: Q: means that the word can be used indifferently as first or secondary word

Posbodyrclong
type: Concept
broader: Posbodyrc
definition: Body related coordinate (longitude on the body)
pref label: pos.bodyrc.long
scope note: Q: means that the word can be used indifferently as first or secondary word

Poscartesian
type: Concept
broader: Pos
definition: Cartesian (rectangular) coordinates
narrower: Poscartesianx
narrower: Poscartesiany
narrower: Poscartesianz
pref label: pos.cartesian
scope note: S: stands for only secondary: the word cannot be used as the first word to describe a single quantity

Poscartesianx
type: Concept
broader: Poscartesian
definition: Cartesian coordinate along the x-axis
pref label: pos.cartesian.x
scope note: Q: means that the word can be used indifferently as first or secondary word

Poscartesiany
type: Concept
broader: Poscartesian
definition: Cartesian coordinate along the y-axis
pref label: pos.cartesian.y
scope note: Q: means that the word can be used indifferently as first or secondary word

Poscartesianz
type: Concept
broader: Poscartesian
definition: Cartesian coordinate along the z-axis
pref label: pos.cartesian.z
scope note: Q: means that the word can be used indifferently as first or secondary word

Poscmb
type: Concept
broader: Pos
definition: Cosmic Microwave Background reference frame
pref label: pos.cmb
scope note: S: stands for only secondary: the word cannot be used as the first word to describe a single quantity

Posdircos
type: Concept
broader: Pos
definition: Direction cosine
pref label: pos.dirCos
scope note: Q: means that the word can be used indifferently as first or secondary word

Posdistance
type: Concept
broader: Pos
definition: Linear distance
pref label: pos.distance
scope note: V: stands for vector. Such a word can be followed by another describing the axis or reference frame in which the measurement is done

Posearth
type: Concept
broader: Pos
definition: Coordinates related to Earth
narrower: Posearthaltitude
narrower: Posearthlat
narrower: Posearthlon
pref label: pos.earth
scope note: S: stands for only secondary: the word cannot be used as the first word to describe a single quantity

Posearthaltitude
type: Concept
broader: Posearth
definition: Altitude, height on Earth above sea level
pref label: pos.earth.altitude
scope note: Q: means that the word can be used indifferently as first or secondary word

Posearthlat
type: Concept
broader: Posearth
definition: Latitude on Earth
pref label: pos.earth.lat
scope note: Q: means that the word can be used indifferently as first or secondary word

Posearthlon
type: Concept
broader: Posearth
definition: Longitude on Earth
pref label: pos.earth.lon
scope note: Q: means that the word can be used indifferently as first or secondary word

Posecliptic
type: Concept
broader: Pos
definition: Ecliptic coordinates
narrower: Poseclipticlat
narrower: Poseclipticlon
pref label: pos.ecliptic
scope note: S: stands for only secondary: the word cannot be used as the first word to describe a single quantity

Poseclipticlat
type: Concept
broader: Posecliptic
definition: Ecliptic latitude
pref label: pos.ecliptic.lat
scope note: Q: means that the word can be used indifferently as first or secondary word

Poseclipticlon
type: Concept
broader: Posecliptic
definition: Ecliptic longitude
pref label: pos.ecliptic.lon
scope note: Q: means that the word can be used indifferently as first or secondary word

Poseop
type: Concept
broader: Pos
definition: Earth orientation parameters
narrower: Poseopnutation
pref label: pos.eop
scope note: S: stands for only secondary: the word cannot be used as the first word to describe a single quantity

Poseopnutation
type: Concept
broader: Poseop
definition: Earth nutation
pref label: pos.eop.nutation
scope note: Q: means that the word can be used indifferently as first or secondary word

Posephem
type: Concept
broader: Pos
definition: Ephemeris
pref label: pos.ephem
scope note: Q: means that the word can be used indifferently as first or secondary word

Poseq
type: Concept
broader: Pos
definition: Equatorial coordinates
narrower: Poseqdec
narrower: Poseqha
narrower: Poseqra
narrower: Poseqspd
pref label: pos.eq
scope note: S: stands for only secondary: the word cannot be used as the first word to describe a single quantity

Poseqdec
type: Concept
broader: Poseq
definition: Declination in equatorial coordinates
pref label: pos.eq.dec
scope note: Q: means that the word can be used indifferently as first or secondary word

Poseqha
type: Concept
broader: Poseq
definition: Hour-angle
pref label: pos.eq.ha
scope note: Q: means that the word can be used indifferently as first or secondary word

Poseqra
type: Concept
broader: Poseq
definition: Right ascension in equatorial coordinates
pref label: pos.eq.ra
scope note: Q: means that the word can be used indifferently as first or secondary word

Poseqspd
type: Concept
broader: Poseq
definition: South polar distance in equatorial coordinates
pref label: pos.eq.spd
scope note: Q: means that the word can be used indifferently as first or secondary word

Poserrorellipse
type: Concept
broader: Pos
definition: Positional error ellipse
pref label: pos.errorEllipse
scope note: S: stands for only secondary: the word cannot be used as the first word to describe a single quantity

Posframe
type: Concept
broader: Pos
definition: Reference frame used for positions
pref label: pos.frame
scope note: Q: means that the word can be used indifferently as first or secondary word

Posgalactic
type: Concept
broader: Pos
definition: Galactic coordinates
narrower: Posgalacticlat
narrower: Posgalacticlon
pref label: pos.galactic
scope note: S: stands for only secondary: the word cannot be used as the first word to describe a single quantity

Posgalacticlat
type: Concept
broader: Posgalactic
definition: Latitude in galactic coordinates
pref label: pos.galactic.lat
scope note: Q: means that the word can be used indifferently as first or secondary word

Posgalacticlon
type: Concept
broader: Posgalactic
definition: Longitude in galactic coordinates
pref label: pos.galactic.lon
scope note: Q: means that the word can be used indifferently as first or secondary word

Posgalactocentric
type: Concept
broader: Pos
definition: Galactocentric coordinate system
pref label: pos.galactocentric
scope note: S: stands for only secondary: the word cannot be used as the first word to describe a single quantity

Posgeocentric
type: Concept
broader: Pos
definition: Geocentric coordinate system
pref label: pos.geocentric
scope note: S: stands for only secondary: the word cannot be used as the first word to describe a single quantity

Poshealpix
type: Concept
broader: Pos
definition: Hierarchical Equal Area IsoLatitude Pixelization
pref label: pos.healpix
scope note: Q: means that the word can be used indifferently as first or secondary word

Posheliocentric
type: Concept
broader: Pos
definition: Heliocentric position coordinate (solar system bodies)
pref label: pos.heliocentric
scope note: S: stands for only secondary: the word cannot be used as the first word to describe a single quantity

Poshtm
type: Concept
broader: Pos
definition: Hierarchical Triangular Mesh
pref label: pos.HTM
scope note: Q: means that the word can be used indifferently as first or secondary word

Poslambert
type: Concept
broader: Pos
definition: Lambert projection
pref label: pos.lambert
scope note: S: stands for only secondary: the word cannot be used as the first word to describe a single quantity

Poslg
type: Concept
broader: Pos
definition: Local Group reference frame
pref label: pos.lg
scope note: S: stands for only secondary: the word cannot be used as the first word to describe a single quantity

Poslsr
type: Concept
broader: Pos
definition: Local Standard of Rest reference frame
pref label: pos.lsr
scope note: S: stands for only secondary: the word cannot be used as the first word to describe a single quantity

Poslunar
type: Concept
broader: Pos
definition: Lunar coordinates
narrower: Poslunaroccult
pref label: pos.lunar
scope note: Q: means that the word can be used indifferently as first or secondary word

Poslunaroccult
type: Concept
broader: Poslunar
definition: Occultation by lunar limb
pref label: pos.lunar.occult
scope note: Q: means that the word can be used indifferently as first or secondary word

Posparallax
type: Concept
broader: Pos
definition: Parallax
narrower: Posparallaxdyn
narrower: Posparallaxphot
narrower: Posparallaxspect
narrower: Posparallaxtrig
pref label: pos.parallax
scope note: Q: means that the word can be used indifferently as first or secondary word

Posparallaxdyn
type: Concept
broader: Posparallax
definition: Dynamical parallax
pref label: pos.parallax.dyn
scope note: Q: means that the word can be used indifferently as first or secondary word

Posparallaxphot
type: Concept
broader: Posparallax
definition: Photometric parallaxes
pref label: pos.parallax.phot
scope note: Q: means that the word can be used indifferently as first or secondary word

Posparallaxspect
type: Concept
broader: Posparallax
definition: Spectroscopic parallax
pref label: pos.parallax.spect
scope note: Q: means that the word can be used indifferently as first or secondary word

Posparallaxtrig
type: Concept
broader: Posparallax
definition: Trigonometric parallax
pref label: pos.parallax.trig
scope note: Q: means that the word can be used indifferently as first or secondary word

Posphaseang
type: Concept
broader: Pos
definition: Phase angle, e.g. elongation of earth from sun as seen from a third cel. object
pref label: pos.phaseAng
scope note: Q: means that the word can be used indifferently as first or secondary word

Pospm
type: Concept
broader: Pos
definition: Proper motion
pref label: pos.pm
scope note: V: stands for vector. Such a word can be followed by another describing the axis or reference frame in which the measurement is done

Posposang
type: Concept
broader: Pos
definition: Position angle of a given vector
pref label: pos.posAng
scope note: Q: means that the word can be used indifferently as first or secondary word

Posprecess
type: Concept
broader: Pos
definition: Precession (in equatorial coordinates)
pref label: pos.precess
scope note: V: stands for vector. Such a word can be followed by another describing the axis or reference frame in which the measurement is done

Possupergalactic
type: Concept
broader: Pos
definition: Supergalactic coordinates
narrower: Possupergalacticlat
narrower: Possupergalacticlon
pref label: pos.supergalactic
scope note: S: stands for only secondary: the word cannot be used as the first word to describe a single quantity

Possupergalacticlat
type: Concept
broader: Possupergalactic
definition: Latitude in supergalactic coordinates
pref label: pos.supergalactic.lat
scope note: Q: means that the word can be used indifferently as first or secondary word

Possupergalacticlon
type: Concept
broader: Possupergalactic
definition: Longitude in supergalactic coordinates
pref label: pos.supergalactic.lon
scope note: Q: means that the word can be used indifferently as first or secondary word

Poswcs
type: Concept
broader: Pos
definition: WCS keywords
narrower: Poswcscdmatrix
narrower: Poswcscrpix
narrower: Poswcscrval
narrower: Poswcsctype
narrower: Poswcsnaxes
narrower: Poswcsnaxis
narrower: Poswcsscale
pref label: pos.wcs
scope note: P: means that the word can only be used as primary or first word

Poswcscdmatrix
type: Concept
broader: Poswcs
definition: WCS CDMATRIX
pref label: pos.wcs.cdmatrix
scope note: P: means that the word can only be used as primary or first word

Poswcscrpix
type: Concept
broader: Poswcs
definition: WCS CRPIX
pref label: pos.wcs.crpix
scope note: P: means that the word can only be used as primary or first word

Poswcscrval
type: Concept
broader: Poswcs
definition: WCS CRVAL
pref label: pos.wcs.crval
scope note: P: means that the word can only be used as primary or first word

Poswcsctype
type: Concept
broader: Poswcs
definition: WCS CTYPE
pref label: pos.wcs.ctype
scope note: P: means that the word can only be used as primary or first word

Poswcsnaxes
type: Concept
broader: Poswcs
definition: WCS NAXES
pref label: pos.wcs.naxes
scope note: P: means that the word can only be used as primary or first word

Poswcsnaxis
type: Concept
broader: Poswcs
definition: WCS NAXIS
pref label: pos.wcs.naxis
scope note: P: means that the word can only be used as primary or first word

Poswcsscale
type: Concept
broader: Poswcs
definition: WCS scale or scale of an image
pref label: pos.wcs.scale
scope note: P: means that the word can only be used as primary or first word

Spect
type: Concept
definition: Spectroscopy
narrower: Spectbinsize
narrower: Spectcontinuum
narrower: Spectdopplerparam
narrower: Spectdopplerveloc
narrower: Spectindex
narrower: Spectline
narrower: Spectresolution
pref label: spect
scope note: Q: means that the word can be used indifferently as first or secondary word

Spectbinsize
type: Concept
broader: Spect
definition: Spectral bin size
pref label: spect.binSize
scope note: Q: means that the word can be used indifferently as first or secondary word

Spectcontinuum
type: Concept
broader: Spect
definition: Continuum spectrum
pref label: spect.continuum
scope note: S: stands for only secondary: the word cannot be used as the first word to describe a single quantity

Spectdopplerparam
type: Concept
broader: Spect
definition: Doppler parameter b
pref label: spect.dopplerParam
scope note: Q: means that the word can be used indifferently as first or secondary word

Spectdopplerveloc
type: Concept
broader: Spect
definition: Radial velocity, derived from the shift of some spectral feature
narrower: Spectdopplervelocopt
narrower: Spectdopplervelocradio
pref label: spect.dopplerVeloc
scope note: E: means a photometric quantity, and can be followed by a word describing a part of the electromagnetic spectrum

Spectdopplervelocopt
type: Concept
broader: Spectdopplerveloc
definition: Radial velocity derived from a wavelength shift using the optical convention
pref label: spect.dopplerVeloc.opt
scope note: E: means a photometric quantity, and can be followed by a word describing a part of the electromagnetic spectrum

Spectdopplervelocradio
type: Concept
broader: Spectdopplerveloc
definition: Radial velocity derived from a frequency shift using the radio convention
pref label: spect.dopplerVeloc.radio
scope note: E: means a photometric quantity, and can be followed by a word describing a part of the electromagnetic spectrum

Spectindex
type: Concept
broader: Spect
definition: Spectral index
pref label: spect.index
scope note: E: means a photometric quantity, and can be followed by a word describing a part of the electromagnetic spectrum

Spectline
type: Concept
broader: Spect
definition: Spectral line
narrower: Spectlineasymmetry
narrower: Spectlinebroad
narrower: Spectlineeqwidth
narrower: Spectlineintensity
narrower: Spectlineprofile
narrower: Spectlinestrength
narrower: Spectlinewidth
pref label: spect.line
scope note: S: stands for only secondary: the word cannot be used as the first word to describe a single quantity

Spectlineasymmetry
type: Concept
broader: Spectline
definition: Line asymmetry
pref label: spect.line.asymmetry
scope note: E: means a photometric quantity, and can be followed by a word describing a part of the electromagnetic spectrum

Spectlinebroad
type: Concept
broader: Spectline
definition: Spectral line broadening
narrower: Spectlinebroadstark
narrower: Spectlinebroadzeeman
pref label: spect.line.broad
scope note: E: means a photometric quantity, and can be followed by a word describing a part of the electromagnetic spectrum

Spectlinebroadstark
type: Concept
broader: Spectlinebroad
definition: Stark line broadening coefficient
pref label: spect.line.broad.Stark
scope note: Q: means that the word can be used indifferently as first or secondary word

Spectlinebroadzeeman
type: Concept
broader: Spectlinebroad
definition: Zeeman broadening
pref label: spect.line.broad.Zeeman
scope note: E: means a photometric quantity, and can be followed by a word describing a part of the electromagnetic spectrum

Spectlineeqwidth
type: Concept
broader: Spectline
definition: Line equivalent width
pref label: spect.line.eqWidth
scope note: E: means a photometric quantity, and can be followed by a word describing a part of the electromagnetic spectrum

Spectlineintensity
type: Concept
broader: Spectline
definition: Line intensity
pref label: spect.line.intensity
scope note: E: means a photometric quantity, and can be followed by a word describing a part of the electromagnetic spectrum

Spectlineprofile
type: Concept
broader: Spectline
definition: Line profile
pref label: spect.line.profile
scope note: E: means a photometric quantity, and can be followed by a word describing a part of the electromagnetic spectrum

Spectlinestrength
type: Concept
broader: Spectline
definition: Spectral line strength S
pref label: spect.line.strength
scope note: Q: means that the word can be used indifferently as first or secondary word

Spectlinewidth
type: Concept
broader: Spectline
definition: Spectral line fwhm
pref label: spect.line.width
scope note: E: means a photometric quantity, and can be followed by a word describing a part of the electromagnetic spectrum

Spectresolution
type: Concept
broader: Spect
definition: Spectral (or velocity) resolution
pref label: spect.resolution
scope note: Q: means that the word can be used indifferently as first or secondary word

Src
type: Concept
definition: Observed source viewed on the sky
narrower: Srccalib
narrower: Srcclass
narrower: Srcdensity
narrower: Srcellipticity
narrower: Srcimpactparam
narrower: Srcmorph
narrower: Srcnet
narrower: Srcorbital
narrower: Srcredshift
narrower: Srcsample
narrower: Srcsptype
narrower: Srcvar
pref label: src
scope note: S: stands for only secondary: the word cannot be used as the first word to describe a single quantity

Srccalib
type: Concept
broader: Src
definition: Calibration source
narrower: Srccalibguidestar
pref label: src.calib
scope note: S: stands for only secondary: the word cannot be used as the first word to describe a single quantity

Srccalibguidestar
type: Concept
broader: Srccalib
definition: Guide star
pref label: src.calib.guideStar
scope note: S: stands for only secondary: the word cannot be used as the first word to describe a single quantity

Srcclass
type: Concept
broader: Src
definition: Source classification (star, galaxy, cluster...)
narrower: Srcclasscolor
narrower: Srcclassdistance
narrower: Srcclassluminosity
narrower: Srcclassrichness
narrower: Srcclassstargalaxy
narrower: Srcclassstruct
pref label: src.class
scope note: Q: means that the word can be used indifferently as first or secondary word

Srcclasscolor
type: Concept
broader: Srcclass
definition: Color classification
pref label: src.class.color
scope note: Q: means that the word can be used indifferently as first or secondary word

Srcclassdistance
type: Concept
broader: Srcclass
definition: Distance class e.g. Abell
pref label: src.class.distance
scope note: Q: means that the word can be used indifferently as first or secondary word

Srcclassluminosity
type: Concept
broader: Srcclass
definition: Luminosity class
pref label: src.class.luminosity
scope note: Q: means that the word can be used indifferently as first or secondary word

Srcclassrichness
type: Concept
broader: Srcclass
definition: Richness class e.g. Abell
pref label: src.class.richness
scope note: Q: means that the word can be used indifferently as first or secondary word

Srcclassstargalaxy
type: Concept
broader: Srcclass
definition: Star/galaxy discriminator, stellarity index
pref label: src.class.starGalaxy
scope note: Q: means that the word can be used indifferently as first or secondary word

Srcclassstruct
type: Concept
broader: Srcclass
definition: Structure classification e.g. Bautz-Morgan
pref label: src.class.struct
scope note: Q: means that the word can be used indifferently as first or secondary word

Srcdensity
type: Concept
broader: Src
definition: Density of sources
pref label: src.density
scope note: Q: means that the word can be used indifferently as first or secondary word

Srcellipticity
type: Concept
broader: Src
definition: Source ellipticity
pref label: src.ellipticity
scope note: Q: means that the word can be used indifferently as first or secondary word

Srcimpactparam
type: Concept
broader: Src
definition: Impact parameter
pref label: src.impactParam
scope note: Q: means that the word can be used indifferently as first or secondary word

Srcmorph
type: Concept
broader: Src
definition: Morphology structure
narrower: Srcmorphparam
narrower: Srcmorphsclength
narrower: Srcmorphtype
pref label: src.morph
scope note: Q: means that the word can be used indifferently as first or secondary word

Srcmorphparam
type: Concept
broader: Srcmorph
definition: Morphological parameter
pref label: src.morph.param
scope note: Q: means that the word can be used indifferently as first or secondary word

Srcmorphsclength
type: Concept
broader: Srcmorph
definition: Scale length for a galactic component (disc or bulge)
pref label: src.morph.scLength
scope note: Q: means that the word can be used indifferently as first or secondary word

Srcmorphtype
type: Concept
broader: Srcmorph
definition: Hubble morphological type (galaxies)
pref label: src.morph.type
scope note: Q: means that the word can be used indifferently as first or secondary word

Srcnet
type: Concept
broader: Src
definition: Qualifier indicating that a quantity (e.g. flux) is background subtracted rather than total
pref label: src.net
scope note: S: stands for only secondary: the word cannot be used as the first word to describe a single quantity

Srcorbital
type: Concept
broader: Src
definition: Orbital parameters
narrower: Srcorbitaleccentricity
narrower: Srcorbitalinclination
narrower: Srcorbitalmeananomaly
narrower: Srcorbitalmeanmotion
narrower: Srcorbitalnode
narrower: Srcorbitalperiastron
pref label: src.orbital
scope note: Q: means that the word can be used indifferently as first or secondary word

Srcorbitaleccentricity
type: Concept
broader: Srcorbital
definition: Orbit eccentricity
pref label: src.orbital.eccentricity
scope note: Q: means that the word can be used indifferently as first or secondary word

Srcorbitalinclination
type: Concept
broader: Srcorbital
definition: Orbit inclination
pref label: src.orbital.inclination
scope note: Q: means that the word can be used indifferently as first or secondary word

Srcorbitalmeananomaly
type: Concept
broader: Srcorbital
definition: Orbit mean anomaly
pref label: src.orbital.meanAnomaly
scope note: Q: means that the word can be used indifferently as first or secondary word

Srcorbitalmeanmotion
type: Concept
broader: Srcorbital
definition: Mean motion
pref label: src.orbital.meanMotion
scope note: Q: means that the word can be used indifferently as first or secondary word

Srcorbitalnode
type: Concept
broader: Srcorbital
definition: Ascending node
pref label: src.orbital.node
scope note: Q: means that the word can be used indifferently as first or secondary word

Srcorbitalperiastron
type: Concept
broader: Srcorbital
definition: Periastron
pref label: src.orbital.periastron
scope note: Q: means that the word can be used indifferently as first or secondary word

Srcredshift
type: Concept
broader: Src
definition: Redshift
narrower: Srcredshiftphot
pref label: src.redshift
scope note: Q: means that the word can be used indifferently as first or secondary word

Srcredshiftphot
type: Concept
broader: Srcredshift
definition: Photometric redshift
pref label: src.redshift.phot
scope note: Q: means that the word can be used indifferently as first or secondary word

Srcsample
type: Concept
broader: Src
definition: Sample
pref label: src.sample
scope note: Q: means that the word can be used indifferently as first or secondary word

Srcsptype
type: Concept
broader: Src
definition: Spectral type MK
pref label: src.spType
scope note: Q: means that the word can be used indifferently as first or secondary word

Srcvar
type: Concept
broader: Src
definition: Variability of source
narrower: Srcvaramplitude
narrower: Srcvarindex
narrower: Srcvarpulse
pref label: src.var
scope note: Q: means that the word can be used indifferently as first or secondary word

Srcvaramplitude
type: Concept
broader: Srcvar
definition: Amplitude of variation
pref label: src.var.amplitude
scope note: E: means a photometric quantity, and can be followed by a word describing a part of the electromagnetic spectrum

Srcvarindex
type: Concept
broader: Srcvar
definition: Variability index
pref label: src.var.index
scope note: Q: means that the word can be used indifferently as first or secondary word

Srcvarpulse
type: Concept
broader: Srcvar
definition: Pulse
pref label: src.var.pulse
scope note: Q: means that the word can be used indifferently as first or secondary word

Stat
type: Concept
definition: Statistical parameters
narrower: Statcorrelation
narrower: Statcovariance
narrower: Staterror
narrower: Statfilling
narrower: Statfit
narrower: Statfourier
narrower: Statlikelihood
narrower: Statmax
narrower: Statmean
narrower: Statmedian
narrower: Statmin
narrower: Statparam
narrower: Statprobability
narrower: Statsnr
narrower: Statstdev
narrower: Statuncalib
narrower: Statvalue
narrower: Statvariance
narrower: Statweight
pref label: stat
scope note: Q: means that the word can be used indifferently as first or secondary word

Statcorrelation
type: Concept
broader: Stat
definition: Correlation between two parameters
pref label: stat.correlation
scope note: P: means that the word can only be used as primary or first word

Statcovariance
type: Concept
broader: Stat
definition: Covariance between two parameters
pref label: stat.covariance
scope note: P: means that the word can only be used as primary or first word

Staterror
type: Concept
broader: Stat
definition: Statistical error
narrower: Staterrorsys
pref label: stat.error
scope note: P: means that the word can only be used as primary or first word

Staterrorsys
type: Concept
broader: Staterror
definition: Systematic error
pref label: stat.error.sys
scope note: P: means that the word can only be used as primary or first word

Statfilling
type: Concept
broader: Stat
definition: Filling factor (volume, time, ..)
pref label: stat.filling
scope note: Q: means that the word can be used indifferently as first or secondary word

Statfit
type: Concept
broader: Stat
definition: Fit
narrower: Statfitchi2
narrower: Statfitdof
narrower: Statfitgoodness
narrower: Statfitomc
narrower: Statfitparam
narrower: Statfitresidual
pref label: stat.fit
scope note: Q: means that the word can be used indifferently as first or secondary word

Statfitchi2
type: Concept
broader: Statfit
definition: Chi-square distribution, test
pref label: stat.fit.chi2
scope note: P: means that the word can only be used as primary or first word

Statfitdof
type: Concept
broader: Statfit
definition: Degrees of freedom
pref label: stat.fit.dof
scope note: P: means that the word can only be used as primary or first word

Statfitgoodness
type: Concept
broader: Statfit
definition: Goodness or significance of fit
pref label: stat.fit.goodness
scope note: P: means that the word can only be used as primary or first word

Statfitomc
type: Concept
broader: Statfit
definition: Observed minus computed
pref label: stat.fit.omc
scope note: S: stands for only secondary: the word cannot be used as the first word to describe a single quantity

Statfitparam
type: Concept
broader: Statfit
definition: Parameter of fit
pref label: stat.fit.param
scope note: Q: means that the word can be used indifferently as first or secondary word

Statfitresidual
type: Concept
broader: Statfit
definition: Residual fit
pref label: stat.fit.residual
scope note: P: means that the word can only be used as primary or first word

Statfourier
type: Concept
broader: Stat
definition: Fourier coefficient
narrower: Statfourieramplitude
pref label: stat.Fourier
scope note: Q: means that the word can be used indifferently as first or secondary word

Statfourieramplitude
type: Concept
broader: Statfourier
definition: Amplitude Fourier coefficient
pref label: stat.Fourier.amplitude
scope note: Q: means that the word can be used indifferently as first or secondary word

Statlikelihood
type: Concept
broader: Stat
definition: Likelihood
pref label: stat.likelihood
scope note: P: means that the word can only be used as primary or first word

Statmax
type: Concept
broader: Stat
definition: Maximum or upper limit
pref label: stat.max
scope note: S: stands for only secondary: the word cannot be used as the first word to describe a single quantity

Statmean
type: Concept
broader: Stat
definition: Mean, average value
pref label: stat.mean
scope note: S: stands for only secondary: the word cannot be used as the first word to describe a single quantity

Statmedian
type: Concept
broader: Stat
definition: Median value
pref label: stat.median
scope note: S: stands for only secondary: the word cannot be used as the first word to describe a single quantity

Statmin
type: Concept
broader: Stat
definition: Minimum or lowest limit
pref label: stat.min
scope note: S: stands for only secondary: the word cannot be used as the first word to describe a single quantity

Statparam
type: Concept
broader: Stat
definition: Parameter
pref label: stat.param
scope note: Q: means that the word can be used indifferently as first or secondary word

Statprobability
type: Concept
broader: Stat
definition: Probability
pref label: stat.probability
scope note: Q: means that the word can be used indifferently as first or secondary word

Statsnr
type: Concept
broader: Stat
definition: Signal to noise ratio
pref label: stat.snr
scope note: P: means that the word can only be used as primary or first word

Statstdev
type: Concept
broader: Stat
definition: Standard deviation
pref label: stat.stdev
scope note: P: means that the word can only be used as primary or first word

Statuncalib
type: Concept
broader: Stat
definition: Qualifier of a generic incalibrated quantity
pref label: stat.uncalib
scope note: S: stands for only secondary: the word cannot be used as the first word to describe a single quantity

Statvalue
type: Concept
broader: Stat
definition: Miscellaneous value
pref label: stat.value
scope note: Q: means that the word can be used indifferently as first or secondary word

Statvariance
type: Concept
broader: Stat
definition: Variance
pref label: stat.variance
scope note: P: means that the word can only be used as primary or first word

Statweight
type: Concept
broader: Stat
definition: Statistical weight
pref label: stat.weight
scope note: P: means that the word can only be used as primary or first word

Time
type: Concept
definition: Time, generic quantity in units of time or date
narrower: Timeage
narrower: Timecreation
narrower: Timecrossing
narrower: Timeduration
narrower: Timeend
narrower: Timeepoch
narrower: Timeequinox
narrower: Timeinterval
narrower: Timelifetime
narrower: Timeperiod
narrower: Timephase
narrower: Timeprocessing
narrower: Timepubliyear
narrower: Timerelax
narrower: Timerelease
narrower: Timeresolution
narrower: Timescale
narrower: Timestart
pref label: time
scope note: Q: means that the word can be used indifferently as first or secondary word

Timeage
type: Concept
broader: Time
definition: Age
pref label: time.age
scope note: Q: means that the word can be used indifferently as first or secondary word

Timecreation
type: Concept
broader: Time
definition: Creation time/date (of dataset, file, catalogue,...)
pref label: time.creation
scope note: Q: means that the word can be used indifferently as first or secondary word

Timecrossing
type: Concept
broader: Time
definition: Crossing time
pref label: time.crossing
scope note: Q: means that the word can be used indifferently as first or secondary word

Timeduration
type: Concept
broader: Time
definition: Interval of time describing the duration of a generic event or phenomenon
pref label: time.duration
scope note: Q: means that the word can be used indifferently as first or secondary word

Timeend
type: Concept
broader: Time
definition: End time/date of a generic event
pref label: time.end
scope note: Q: means that the word can be used indifferently as first or secondary word

Timeepoch
type: Concept
broader: Time
definition: Instant of time related to a generic event (epoch, date, Julian date, time stamp/tag,...)
pref label: time.epoch
scope note: Q: means that the word can be used indifferently as first or secondary word

Timeequinox
type: Concept
broader: Time
definition: Equinox
pref label: time.equinox
scope note: Q: means that the word can be used indifferently as first or secondary word

Timeinterval
type: Concept
broader: Time
definition: Time interval, time-bin, time elapsed between two events, not the duration of an event
pref label: time.interval
scope note: Q: means that the word can be used indifferently as first or secondary word

Timelifetime
type: Concept
broader: Time
definition: Lifetime
pref label: time.lifetime
scope note: Q: means that the word can be used indifferently as first or secondary word

Timeperiod
type: Concept
broader: Time
definition: Period, interval of time between the recurrence of phases in a periodic phenomenon
pref label: time.period
scope note: Q: means that the word can be used indifferently as first or secondary word

Timephase
type: Concept
broader: Time
definition: Phase, position within a period
pref label: time.phase
scope note: Q: means that the word can be used indifferently as first or secondary word

Timeprocessing
type: Concept
broader: Time
definition: A time/date associated with the processing of data
pref label: time.processing
scope note: Q: means that the word can be used indifferently as first or secondary word

Timepubliyear
type: Concept
broader: Time
definition: Publication year
pref label: time.publiYear
scope note: Q: means that the word can be used indifferently as first or secondary word

Timerelax
type: Concept
broader: Time
definition: Relaxation time
pref label: time.relax
scope note: Q: means that the word can be used indifferently as first or secondary word

Timerelease
type: Concept
broader: Time
definition: The time/date data is available to the public
pref label: time.release
scope note: Q: means that the word can be used indifferently as first or secondary word

Timeresolution
type: Concept
broader: Time
definition: Time resolution
pref label: time.resolution
scope note: Q: means that the word can be used indifferently as first or secondary word

Timescale
type: Concept
broader: Time
definition: Timescale
pref label: time.scale
scope note: Q: means that the word can be used indifferently as first or secondary word

Timestart
type: Concept
broader: Time
definition: Start time/date of generic event
pref label: time.start
scope note: Q: means that the word can be used indifferently as first or secondary word